Target
Aldehyde dehydrogenase, mitochondrial
Ligand
BDBM22794
Substrate
Meas. Tech.
ChEMBL_1295309 (CHEMBL3128576)
Ki
15000±n/a nM
Citation
 Kimble-Hill, ACParajuli, BChen, CHMochly-Rosen, DHurley, TD Development of selective inhibitors for aldehyde dehydrogenases based on substituted indole-2,3-diones. J Med Chem 57:714-22 (2014)  
Target
Name:
Aldehyde dehydrogenase, mitochondrial
Synonyms:
ALDH class 2 ALDH2 ALDHI Aldehyde dehydrogenase (ALDH2)
Type:
Enzyme
Mol. Mass.:
56382.67
Organism:
Homo sapiens (Human)
Description:
P05091
Residue:
517
  
Inhibitor
Name:
BDBM22794
Synonyms:
1-benzyl-2,3-dihydro-1H-indole-2,3-dione | Isatin-based compound, 14
Type:
Small organic molecule
Emp. Form.:
C15H11NO2
Mol. Mass.:
237.2533
SMILES:
O=C1N(Cc2ccccc2)c2ccccc2C1=O
: