Target
Aldehyde dehydrogenase, mitochondrial
Ligand
BDBM47880
Substrate
Meas. Tech.
ChEMBL_1295317 (CHEMBL3130565)
IC50
1200±n/a nM
Citation
 Kimble-Hill, ACParajuli, BChen, CHMochly-Rosen, DHurley, TD Development of selective inhibitors for aldehyde dehydrogenases based on substituted indole-2,3-diones. J Med Chem 57:714-22 (2014)  
Target
Name:
Aldehyde dehydrogenase, mitochondrial
Synonyms:
ALDH class 2 ALDH2 ALDHI Aldehyde dehydrogenase (ALDH2)
Type:
Enzyme
Mol. Mass.:
56382.67
Organism:
Homo sapiens (Human)
Description:
P05091
Residue:
517
  
Inhibitor
Name:
BDBM47880
Synonyms:
1-(3-phenylpropyl)indole-2,3-dione MLS001183545 cid_2282752
Type:
Small organic molecule
Emp. Form.:
C17H15NO2
Mol. Mass.:
265.3065
SMILES:
O=C1N(CCCc2ccccc2)c2ccccc2C1=O
: