Target
Aldehyde dehydrogenase, mitochondrial
Ligand
BDBM50133625
Substrate
Meas. Tech.
ChEMBL_1295317 (CHEMBL3130565)
IC50
2100±n/a nM
Citation
 Kimble-Hill, ACParajuli, BChen, CHMochly-Rosen, DHurley, TD Development of selective inhibitors for aldehyde dehydrogenases based on substituted indole-2,3-diones. J Med Chem 57:714-22 (2014)  
Target
Name:
Aldehyde dehydrogenase, mitochondrial
Synonyms:
ALDH class 2 ALDH2 ALDHI Aldehyde dehydrogenase (ALDH2)
Type:
Enzyme
Mol. Mass.:
56382.67
Organism:
Homo sapiens (Human)
Description:
P05091
Residue:
517
  
Inhibitor
Name:
BDBM50133625
Synonyms:
1-Benzyl-5-chloro-1H-indole-2,3-dione | CHEMBL336693
Type:
Small organic molecule
Emp. Form.:
C15H10ClNO2
Mol. Mass.:
271.698
SMILES:
Clc1ccc2N(Cc3ccccc3)C(=O)C(=O)c2c1
: