Target
Aldehyde dehydrogenase 1A1
Ligand
BDBM22794
Substrate
Meas. Tech.
ChEMBL_1295319 (CHEMBL3130567)
IC50
20±n/a nM
Citation
 Kimble-Hill, ACParajuli, BChen, CHMochly-Rosen, DHurley, TD Development of selective inhibitors for aldehyde dehydrogenases based on substituted indole-2,3-diones. J Med Chem 57:714-22 (2014)  
Target
Name:
Aldehyde dehydrogenase 1A1
Synonyms:
AL1A1_HUMAN ALDH-E1 ALDH1A1 Aldehyde dehydrogenase 1A1 (ALDH1A1) Aldehyde dehydrogenase family 1 member A1 (ALDH1A1) PUMB1 RalDH1 | Retinal dehydrogenase 1
Type:
Protein
Mol. Mass.:
54862.21
Organism:
Homo sapiens (Human)
Description:
Residue:
501
  
Inhibitor
Name:
BDBM22794
Synonyms:
1-benzyl-2,3-dihydro-1H-indole-2,3-dione | Isatin-based compound, 14
Type:
Small organic molecule
Emp. Form.:
C15H11NO2
Mol. Mass.:
237.2533
SMILES:
O=C1N(Cc2ccccc2)c2ccccc2C1=O
: