Target
Tyrosine-protein kinase JAK2
Ligand
BDBM50449376
Substrate
Meas. Tech.
ChEMBL_1297187 (CHEMBL3131376)
IC50
0.600000±n/a nM
Citation
 Siu, TKumarasinghe, SEAltman, MDKatcher, MNorthrup, AWhite, CRosenstein, CMathur, AXu, LChan, GBachman, EBouthillette, MDinsmore, CJMarshall, CGYoung, JR The discovery of reverse tricyclic pyridone JAK2 inhibitors. Part 2: lead optimization. Bioorg Med Chem Lett 24:1466-71 (2014)  
Target
Name:
Tyrosine-protein kinase JAK2
Synonyms:
JAK-2 JAK2_HUMAN Janus kinase 2 (JAK2) | Janus kinase 2 (a protein tyrosine kinase)
Type:
Protein
Mol. Mass.:
130684.68
Organism:
Homo sapiens (Human)
Description:
O60674
Residue:
1132
  
Inhibitor
Name:
BDBM50449376
Synonyms:
CHEMBL3126346
Type:
Small organic molecule
Emp. Form.:
C19H14Cl2N4O2
Mol. Mass.:
401.246
SMILES:
CC(O)c1cc(Cl)c(Nc2nc3ccncc3c3c2cc[nH]c3=O)c(Cl)c1
: