Target
5-hydroxytryptamine receptor 3A/3B
Ligand
BDBM50452967
Substrate
Meas. Tech.
ChEMBL_3039 (CHEMBL620657)
IC50
42±n/a nM
Citation
 Swain, CJBaker, RKneen, CMoseley, JSaunders, JSeward, EMStevenson, GBeer, MStanton, JWatling, K Novel 5-HT3 antagonists. Indole oxadiazoles. J Med Chem 34:140-51 (1991)  
Target
Name:
5-hydroxytryptamine receptor 3A/3B
Synonyms:
Serotonin 3 (5-HT3) receptor | Serotonin 3a (5-HT3a)/3b (5-HT3b) receptor
Type:
Mol. Mass.:
Description:
ASSAY_ID of EBI is 2974
Components:
This complex has 2 components.
Component 1
Name:
5-hydroxytryptamine receptor 3B
Synonyms:
5HT3B_RAT Serotonin (5-HT) receptor
Type:
PROTEIN
Mol. Mass.:
50328.78
Organism:
Rattus norvegicus
Description:
EBI_11885
Residue:
437
  
Component 2
Name:
5-hydroxytryptamine receptor 3A
Synonyms:
5-HT3 5HT3A_RAT Htr3 Serotonin (5-HT) receptor | Zacopride site-R
Type:
Enzyme Catalytic Domain
Mol. Mass.:
55428.70
Organism:
RAT
Description:
5-HT3 HTR3A RAT::P35563
Residue:
483
  
Inhibitor
Name:
BDBM50452967
Synonyms:
CHEMBL284315
Type:
Small organic molecule
Emp. Form.:
C15H17N3O2
Mol. Mass.:
271.3144
SMILES:
Oc1ccccc1-c1noc(n1)C1CN2CCC1CC2
: