Target
D(1A) dopamine receptor
Ligand
BDBM50409510
Substrate
Meas. Tech.
ChEMBL_58818 (CHEMBL857791)
Ki
324±n/a nM
Citation
 Cortizo, LSantana, LRavina, EOrallo, FFontenla, JACastro, ECalleja, JMde Ceballos, ML Synthesis and antidopaminergic activity of some 3-(aminomethyl)tetralones as analogues of butyrophenone. J Med Chem 34:2242-7 (1991)  
Target
Name:
D(1A) dopamine receptor
Synonyms:
DOPAMINE D1 Dopamine D1 high Dopamine receptor Dopamine1-like Drd1a
Type:
Enzyme Catalytic Domain
Mol. Mass.:
49429.75
Organism:
RAT
Description:
P18901
Residue:
446
  
Inhibitor
Name:
BDBM50409510
Synonyms:
CHEMBL308480
Type:
Small organic molecule
Emp. Form.:
C23H24FNO2
Mol. Mass.:
365.4406
SMILES:
Fc1ccc(cc1)C(=O)C1CCN(CC2CC(=O)c3ccccc3C2)CC1
: