Target
Peroxisome proliferator-activated receptor gamma
Ligand
BDBM50418574
Substrate
Meas. Tech.
ChEMBL_154529 (CHEMBL760250)
Ki
123±n/a nM
Citation
 Henke, BRBlanchard, SGBrackeen, MFBrown, KKCobb, JECollins, JLHarrington, WWHashim, MAHull-Ryde, EAKaldor, IKliewer, SALake, DHLeesnitzer, LMLehmann, JMLenhard, JMOrband-Miller, LAMiller, JFMook, RANoble, SAOliver, WParks, DJPlunket, KDSzewczyk, JRWillson, TM N-(2-Benzoylphenyl)-L-tyrosine PPARgamma agonists. 1. Discovery of a novel series of potent antihyperglycemic and antihyperlipidemic agents. J Med Chem 41:5020-36 (1999)  
Target
Name:
Peroxisome proliferator-activated receptor gamma
Synonyms:
NR1C3 PPAR-gamma PPARG_HUMAN Peroxisome proliferator-activated receptor gamma (PPAR gamma) Peroxisome proliferator-activated receptor gamma (PPARĪ³) peroxisome proliferator-activated receptor gamma isoform 2
Type:
Nuclear Receptor
Mol. Mass.:
57613.46
Organism:
Homo sapiens (Human)
Description:
P37231
Residue:
505
  
Inhibitor
Name:
BDBM50418574
Synonyms:
CHEMBL146123
Type:
Small organic molecule
Emp. Form.:
C31H29N3O6S
Mol. Mass.:
571.643
SMILES:
CN(CCOc1ccc(CC(Nc2ccccc2S(=O)(=O)c2ccccc2)C(O)=O)cc1)c1nc2ccccc2o1
: