Target
Substance-P receptor
Ligand
BDBM50000221
Substrate
Meas. Tech.
ChEMBL_205901 (CHEMBL814485)
Ki
2.5±n/a nM
Citation
 Genicot, CChristophe, BCollart, PGillard, MGoossens, LHénichart, JPLassoie, MAMoureau, FNeuwels, MNicolas, JMPasau, PQuéré, LRyckmans, TStiernet, FTaverne, TVan Keulen, BJ Discovery of orally bioavailable NK1 receptor antagonists. Bioorg Med Chem Lett 13:437-42 (2003)  
Target
Name:
Substance-P receptor
Synonyms:
NK-1 receptor NK1 Receptor NK1R_HUMAN Neurokinin-1 (NK-1) SPR TACR1 Tachykinin receptor 1 (NK1) | tachykinin
Type:
G Protein-Coupled Receptor (GPCR)
Mol. Mass.:
46254.43
Organism:
Homo sapiens (Human)
Description:
P25103
Residue:
407
  
Inhibitor
Name:
BDBM50000221
Synonyms:
CHEMBL336251
Type:
Small organic molecule
Emp. Form.:
C25H30F6N2O
Mol. Mass.:
488.5089
SMILES:
CCCCN1CCN(CC1)C(COCc1cc(cc(c1)C(F)(F)F)C(F)(F)F)c1ccccc1
: