Target
Substance-P receptor
Ligand
BDBM50000252
Substrate
Meas. Tech.
ChEMBL_205901 (CHEMBL814485)
Ki
1.3±n/a nM
Citation
 Genicot, CChristophe, BCollart, PGillard, MGoossens, LHénichart, JPLassoie, MAMoureau, FNeuwels, MNicolas, JMPasau, PQuéré, LRyckmans, TStiernet, FTaverne, TVan Keulen, BJ Discovery of orally bioavailable NK1 receptor antagonists. Bioorg Med Chem Lett 13:437-42 (2003)  
Target
Name:
Substance-P receptor
Synonyms:
NK-1 receptor NK1 Receptor NK1R_HUMAN Neurokinin-1 (NK-1) SPR TACR1 Tachykinin receptor 1 (NK1) | tachykinin
Type:
G Protein-Coupled Receptor (GPCR)
Mol. Mass.:
46254.43
Organism:
Homo sapiens (Human)
Description:
P25103
Residue:
407
  
Inhibitor
Name:
BDBM50000252
Synonyms:
CHEMBL136347
Type:
Small organic molecule
Emp. Form.:
C24H26F6N2O3
Mol. Mass.:
504.4653
SMILES:
C[C@H](OC[C@@H](N1CCN(CC(O)=O)CC1)c1ccccc1)c1cc(cc(c1)C(F)(F)F)C(F)(F)F
: