Target
Gag-Pol polyprotein [489-587]
Ligand
BDBM50000815
Substrate
Meas. Tech.
ChEMBL_158036 (CHEMBL768260)
Ki
0.60±n/a nM
Citation
 Doweyko, AM Three-dimensional pharmacophores from binding data. J Med Chem 37:1769-78 (1994)  
Target
Name:
Gag-Pol polyprotein [489-587]
Synonyms:
Human immunodeficiency virus type 1 protease Pol polyprotein | gag-pol
Type:
Enzyme Subunit
Mol. Mass.:
10781.16
Organism:
Human immunodeficiency virus type 1
Description:
P04585[489-587]
Residue:
99
  
Inhibitor
Name:
BDBM50000815
Synonyms:
CHEMBL46337
Type:
Small organic molecule
Emp. Form.:
C41H54N4O8
Mol. Mass.:
730.8895
SMILES:
CC[C@H](C)[C@H](NC(=O)[C@H](Cc1ccccc1)NC(=O)C[C@H](O)[C@H](Cc1ccccc1)NC(=O)OC(C)(C)C)C(=O)N[C@@H](Cc1ccccc1)C(=O)OC
: