Target
Solute carrier family 22 member 2
Ligand
BDBM39344
Substrate
Meas. Tech.
ChEMBL_836107 (CHEMBL2077543)
IC50
90000±n/a nM
Citation
 Goralski, KBLou, GProwse, MTGorboulev, VVolk, CKoepsell, HSitar, DS The cation transporters rOCT1 and rOCT2 interact with bicarbonate but play only a minor role for amantadine uptake into rat renal proximal tubules. J Pharmacol Exp Ther 303:959-68 (2002)  
Target
Name:
Solute carrier family 22 member 2
Synonyms:
Adrenaline alpha2 Organic cation transporter 2 Slc22a2 rOCT2
Type:
Enzyme Catalytic Domain
Mol. Mass.:
62348.38
Organism:
RAT
Description:
Adrenaline alpha2 0 RAT::Q9R0W2
Residue:
555
  
Inhibitor
Name:
BDBM39344
Synonyms:
4-amino-N-[2-(diethylamino)ethyl]benzamide;hydrochloride MLS000069436 PROCAINAMIDE HYDROCHLORIDE cid_66068
Type:
Small organic molecule
Emp. Form.:
C13H21N3O
Mol. Mass.:
235.3253
SMILES:
CCN(CC)CCNC(=O)c1ccc(N)cc1
: