Target
Carbonic anhydrase 2
Ligand
BDBM10867
Substrate
Meas. Tech.
ChEMBL_956003 (CHEMBL2380060)
Ki
75±n/a nM
Citation
 Vullo, DLuca, VDScozzafava, ACarginale, VRossi, MSupuran, CTCapasso, C The alpha-carbonic anhydrase from the thermophilic bacterium Sulfurihydrogenibium yellowstonense YO3AOP1 is highly susceptible to inhibition by sulfonamides. Bioorg Med Chem 21:1534-8 (2013)  
Target
Name:
Carbonic anhydrase 2
Synonyms:
CA-II CAC Carbonate dehydratase II Carbonic anhydrase 2 (CA-II) Carbonic anhydrase C Carbonic anhydrase II (CA-II) Carbonic anhydrase II (hCA II) | Carbonic anhydrase isoenzyme II (hCA II)
Type:
Enzyme
Mol. Mass.:
29250.71
Organism:
Homo sapiens (Human)
Description:
P00918
Residue:
260
  
Inhibitor
Name:
BDBM10867
Synonyms:
4-amino-6-chlorobenzene-1,3-disulfonamide aromatic/heteroaromatic sulfonamide 12
Type:
Small organic molecule
Emp. Form.:
C6H8ClN3O4S2
Mol. Mass.:
285.728
SMILES:
Nc1cc(Cl)c(cc1S(N)(=O)=O)S(N)(=O)=O
: