Target
Acetylcholinesterase
Ligand
BDBM50005192
Substrate
Meas. Tech.
ChEMBL_1281569 (CHEMBL3102254)
Ki
0.23±n/a nM
Citation
 Butini, SBrindisi, MBrogi, SMaramai, SGuarino, EPanico, ASaxena, AChauhan, VColombo, RVerga, LDe Lorenzi, EBartolini, MAndrisano, VNovellino, ECampiani, GGemma, S Multifunctional cholinesterase and amyloid Beta fibrillization modulators. Synthesis and biological investigation. ACS Med Chem Lett 4:1178-82 (2013)  
Target
Name:
Acetylcholinesterase
Synonyms:
ACES_HUMAN Acetylcholinesterase (AChE) | Acetylcholinesterase (human AChE)
Type:
Enzyme
Mol. Mass.:
67792.70
Organism:
Homo sapiens (Human)
Description:
P22303
Residue:
614
  
Inhibitor
Name:
BDBM50005192
Synonyms:
CHEMBL3099497
Type:
Small organic molecule
Emp. Form.:
C34H43N5
Mol. Mass.:
521.7387
SMILES:
Nc1cccc2c(NCCCCCCCCNc3c4CCCCc4nc4ccccc34)c3CCCCc3nc12
: