Target
Histamine H2 receptor
Ligand
BDBM50000411
Substrate
Meas. Tech.
ChEMBL_1333836 (CHEMBL3231654)
EC50
4600±n/a nM
Citation
 Bolhofer, WAHoffman, JMHabecker, CNPietruszkiewicz, AMCragoe, EJTorchiana, ML Inhibition of gastric acid secretion by 1,8-naphthyridin-2(1H)-ones. J Med Chem 22:301-6 (1979)  
Target
Name:
Histamine H2 receptor
Synonyms:
Gastric receptor I HISTAMINE H2 Hrh2
Type:
Enzyme Catalytic Domain
Mol. Mass.:
40269.37
Organism:
RAT
Description:
HISTAMINE H2 HRH2 RAT::P25102
Residue:
358
  
Inhibitor
Name:
BDBM50000411
Synonyms:
CHEMBL3228809
Type:
Small organic molecule
Emp. Form.:
C18H27N3O
Mol. Mass.:
301.4265
SMILES:
CC(C)N(CCn1c2nc(C)cc(C)c2ccc1=O)C(C)C
: