Target
Neuronal acetylcholine receptor subunit alpha-4/beta-2
Ligand
BDBM50001725
Substrate
Meas. Tech.
ChEMBL_1337305 (CHEMBL3241029)
IC50
>10000±n/a nM
Citation
 Chang, YPBanerjee, JDowell, CWu, JGyanda, RHoughten, RAToll, LMcIntosh, JMArmishaw, CJ Discovery of a potent and selectivea3ß4 nicotinic acetylcholine receptor antagonist from ana-conotoxin synthetic combinatorial library. J Med Chem 57:3511-21 (2014)  
Target
Name:
Neuronal acetylcholine receptor subunit alpha-4/beta-2
Synonyms:
Neuronal acetylcholine receptor alpha4/beta2 Neuronal acetylcholine receptor; alpha4/beta2
Type:
Mol. Mass.:
Description:
Components:
This complex has 0 components.
Component 1
Name:
Neuronal acetylcholine receptor subunit alpha-4
Synonyms:
ACHA4_RAT Cholinergic, Nicotinic Alpha4Beta2 Chrna4 Neuronal acetylcholine receptor (alpha4beta2 nAChR) Neuronal acetylcholine receptor subunit alpha 4 beta 2 | Neuronal acetylcholine receptor subunit alpha-4
Type:
Enzyme
Mol. Mass.:
70196.44
Organism:
Rattus norvegicus (Rat)
Description:
P09483
Residue:
630
  
Component 2
Name:
Neuronal acetylcholine receptor subunit beta-2
Synonyms:
ACHB2_RAT Chrnb2 Neuronal acetylcholine receptor non-alpha-1 chain
Type:
Enzyme
Mol. Mass.:
56910.32
Organism:
Rattus norvegicus (Rat)
Description:
P12390
Residue:
500
  
Inhibitor
Name:
BDBM50001725
Synonyms:
CHEMBL3238067
Type:
Small organic molecule
Emp. Form.:
C61H83N15O16S4
Mol. Mass.:
1410.663
SMILES:
[H][C@@]12CCCN1C(=O)[C@]1([H])CCCN1C(=O)[C@H](Cc1cnc[nH]1)NC(=O)[C@H](CO)NC(=O)[C@]1([H])CSSC[C@H](NC(=O)[C@H](Cc3ccc(O)cc3)NC(=O)[C@H](CCCC)NC(=O)[C@H](CC)NC(=O)[C@H](Cc3ccccc3)NC(=O)[C@]([H])(CSSC[C@H](NC(=O)CN)C(=O)N1)NC2=O)C(O)=O
: