Target
Cholinesterase
Ligand
BDBM50002851
Substrate
Meas. Tech.
ChEMBL_1339398 (CHEMBL3243766)
IC50
6020±n/a nM
Citation
 Pudlo, MLuzet, VIsmaïli, LTomassoli, IIutzeler, ARefouvelet, B Quinolone-benzylpiperidine derivatives as novel acetylcholinesterase inhibitor and antioxidant hybrids for Alzheimer disease. Bioorg Med Chem 22:2496-507 (2014)  
Target
Name:
Cholinesterase
Synonyms:
BCHE CHLE_HORSE | Cholinesterase
Type:
Enzyme
Mol. Mass.:
65643.35
Organism:
Equus caballus (Horse)
Description:
P81908
Residue:
574
  
Inhibitor
Name:
BDBM50002851
Synonyms:
CHEMBL3233664
Type:
Small organic molecule
Emp. Form.:
C23H25N3O3
Mol. Mass.:
391.4629
SMILES:
Oc1c(C(=O)NCC2CCN(Cc3ccccc3)CC2)c(=O)[nH]c2ccccc12
: