Target
Heat shock protein HSP 90-beta
Ligand
BDBM50445478
Substrate
Meas. Tech.
ChEMBL_1336953 (CHEMBL3242261)
IC50
30±n/a nM
Citation
 Ernst, JTNeubert, TLiu, MSperry, SZuccola, HTurnbull, AFleck, BKargo, WWoody, LChiang, PTran, DChen, WSnyder, PAlcacio, TNezami, AReynolds, JAlvi, KGoulet, LStamos, D Identification of novel HSP90a/ß isoform selective inhibitors using structure-based drug design. demonstration of potential utility in treating CNS disorders such as Huntington's disease. J Med Chem 57:3382-400 (2014)  
Target
Name:
Heat shock protein HSP 90-beta
Synonyms:
HS90B_HUMAN HSP 90 HSP90B HSPCB Heat shock protein HSP 90 (Hsp90)
Type:
Molecular Chaperone
Mol. Mass.:
83229.45
Organism:
Homo sapiens (Human)
Description:
P08238
Residue:
724
  
Inhibitor
Name:
BDBM50445478
Synonyms:
CHEMBL3104858
Type:
Small organic molecule
Emp. Form.:
C22H26FN3O3
Mol. Mass.:
399.4585
SMILES:
Cc1cn(c2CC(C)(C)CC(=O)c12)-c1cc(F)c(C(N)=O)c(N[C@H]2CCOC2)c1
: