Target
Acetylcholinesterase
Ligand
BDBM50005562
Substrate
Meas. Tech.
ChEMBL_1339053 (CHEMBL3243111)
Kd
30000±n/a nM
Citation
 Kliachyna, MSantoni, GNussbaum, VRenou, JSanson, BColletier, JPArboléas, MLoiodice, MWeik, MJean, LRenard, PYNachon, FBaati, R Design, synthesis and biological evaluation of novel tetrahydroacridine pyridine- aldoxime and -amidoxime hybrids as efficient uncharged reactivators of nerve agent-inhibited human acetylcholinesterase. Eur J Med Chem 78:455-67 (2014)  
Target
Name:
Acetylcholinesterase
Synonyms:
ACES_HUMAN Acetylcholinesterase (AChE) | Acetylcholinesterase (human AChE)
Type:
Enzyme
Mol. Mass.:
67792.70
Organism:
Homo sapiens (Human)
Description:
P22303
Residue:
614
  
Inhibitor
Name:
BDBM50005562
Synonyms:
CHEMBL138290 | CHEMBL3234586
Type:
Small organic molecule
Emp. Form.:
C24H30N6O2
Mol. Mass.:
434.534
SMILES:
CN(CCCNc1c2CCCCc2nc2ccccc12)Cc1ccnc(\C(N)=N\O)c1O
: