Target
Acetylcholinesterase
Ligand
BDBM50005583
Substrate
Meas. Tech.
ChEMBL_1338714 (CHEMBL3242185)
IC50
77±n/a nM
Citation
 Kliachyna, MSantoni, GNussbaum, VRenou, JSanson, BColletier, JPArboléas, MLoiodice, MWeik, MJean, LRenard, PYNachon, FBaati, R Design, synthesis and biological evaluation of novel tetrahydroacridine pyridine- aldoxime and -amidoxime hybrids as efficient uncharged reactivators of nerve agent-inhibited human acetylcholinesterase. Eur J Med Chem 78:455-67 (2014)  
Target
Name:
Acetylcholinesterase
Synonyms:
ACES_HUMAN Acetylcholinesterase (AChE) | Acetylcholinesterase (human AChE)
Type:
Enzyme
Mol. Mass.:
67792.70
Organism:
Homo sapiens (Human)
Description:
P22303
Residue:
614
  
Inhibitor
Name:
BDBM50005583
Synonyms:
CHEMBL138668 | CHEMBL3234592
Type:
Small organic molecule
Emp. Form.:
C24H28N4O2
Mol. Mass.:
404.5047
SMILES:
O\N=C\c1nccc(CCCCCNc2c3CCCCc3nc3ccccc23)c1O
: