Target
Advanced glycosylation end product-specific receptor
Ligand
BDBM50005635
Substrate
Meas. Tech.
ChEMBL_1339876 (CHEMBL3243665)
IC50
5300±n/a nM
Citation
 Han, YTKim, KChoi, GIAn, HSon, DKim, HHa, HJSon, JHChung, SJPark, HJLee, JSuh, YG Pyrazole-5-carboxamides, novel inhibitors of receptor for advanced glycation end products (RAGE). Eur J Med Chem 79:128-42 (2014)  
Target
Name:
Advanced glycosylation end product-specific receptor
Synonyms:
AGER RAGE_HUMAN | Receptor for advanced glycosylation end products
Type:
PROTEIN
Mol. Mass.:
42800.11
Organism:
Homo sapiens (Human)
Description:
ChEMBL_1339877
Residue:
404
  
Inhibitor
Name:
BDBM50005635
Synonyms:
CHEMBL3235378
Type:
Small organic molecule
Emp. Form.:
C35H43ClN4O5
Mol. Mass.:
635.193
SMILES:
CCCCOc1cc(OCCCN(CC)CC)ccc1NC(=O)c1cc(nn1C)-c1ccc(Oc2ccc(Cl)c(OC)c2)cc1
: