Target
Transient receptor potential cation channel subfamily V member 1
Ligand
BDBM22988
Substrate
Meas. Tech.
ChEMBL_1334655 (CHEMBL3239855)
EC50
630±n/a nM
Citation
 Han, SThatte, JBuzard, DJJones, RM Therapeutic utility of cannabinoid receptor type 2 (CB(2)) selective agonists. Cell Chem Biol 56:8224-56 (2013)  
Target
Name:
Transient receptor potential cation channel subfamily V member 1
Synonyms:
Capsaicin receptor Osm-9-like TRP channel 1 TRPV1_HUMAN Transient receptor potential cation channel subfamily V member 1 (TRPV1) Transient receptor potential cation channel subfamily V member 1(TRPV1) Vanilloid VR1 Vanilloid receptor 1 Vanilloid receptor 1 (VRI/TRPV1)
Type:
Protein
Mol. Mass.:
94960.75
Organism:
Homo sapiens (Human)
Description:
Q8NER1
Residue:
839
  
Inhibitor
Name:
BDBM22988
Synonyms:
(5Z,8Z,11Z,14Z)-N-(2-hydroxyethyl)icosa-5,8,11,14-tetraenamide ANANDAMIDE Arachidonoyl ethanolamide (AEA) Arachidonylethanolamide [14C]Anandamide | [3H]Anandamide
Type:
radiolabeled substrate
Emp. Form.:
C22H37NO2
Mol. Mass.:
347.5347
SMILES:
CCCCC\C=C/C\C=C/C\C=C/C\C=C/CCCC(=O)NCCO
: