Target
Cannabinoid receptor 1
Ligand
BDBM50072769
Substrate
Meas. Tech.
ChEMBL_1334652 (CHEMBL3239852)
Ki
1.4±n/a nM
Citation
 Han, SThatte, JBuzard, DJJones, RM Therapeutic utility of cannabinoid receptor type 2 (CB(2)) selective agonists. Cell Chem Biol 56:8224-56 (2013)  
Target
Name:
Cannabinoid receptor 1
Synonyms:
Brain-type cannabinoid receptor CB-R CNR1_RAT Cannabinoid receptor Cnr1 | Skr6
Type:
G Protein-Coupled Receptor (GPCR)
Mol. Mass.:
52856.55
Organism:
Rattus norvegicus (rat)
Description:
P20272
Residue:
473
  
Inhibitor
Name:
BDBM50072769
Synonyms:
(5Z,8Z,11Z,14Z)-Icosa-5,8,11,14-tetraenoic acid (2-chloro-ethyl)-amide CHEMBL151167 | N-(2-chloroethyl)icosa-5,8,11,14-tetraenamide
Type:
Small organic molecule
Emp. Form.:
C22H36ClNO
Mol. Mass.:
365.98
SMILES:
CCCCC\C=C/C\C=C/C\C=C/C\C=C/CCCC(=O)NCCCl
: