Target
Acetylcholine receptor subunit alpha/Neuronal acetylcholine receptor subunit beta-2
Ligand
BDBM50006614
Substrate
Meas. Tech.
ChEMBL_1335284 (CHEMBL3238708)
Ki
1000±n/a nM
Citation
 Gao, YKellar, KJYasuda, RPTran, TXiao, YDannals, RFHorti, AG Derivatives of dibenzothiophene for positron emission tomography imaging ofa7-nicotinic acetylcholine receptors. J Med Chem 56:7574-89 (2013)  
Target
Name:
Acetylcholine receptor subunit alpha/Neuronal acetylcholine receptor subunit beta-2
Synonyms:
Nicotinic acetylcholine receptor alpha2/beta2
Type:
Mol. Mass.:
Description:
ASSAY_ID of ChEMBL is 964980
Components:
This complex has 2 components.
Component 1
Name:
Acetylcholine receptor subunit alpha
Synonyms:
ACHA_HUMAN Acetylcholine receptor protein alpha chain CHNRA Cholinergic, Nicotinic Alpha1Beta1DeltaGamma Nicotinic acetylcholine receptor alpha-1/beta-1 Nicotinic acetylcholine receptor alpha2/beta4 n-AChR
Type:
Ion channel
Mol. Mass.:
54542.01
Organism:
Homo sapiens (Human)
Description:
Residue:
482
  
Component 2
Name:
Neuronal acetylcholine receptor subunit beta-2
Synonyms:
ACHB2_HUMAN Neuronal acetylcholine receptor protein beta-2 subunit | Nicotinic acetylcholine receptor alpha3/beta2/alpha5
Type:
Protein
Mol. Mass.:
57020.50
Organism:
Homo sapiens (Human)
Description:
P17787
Residue:
502
  
Inhibitor
Name:
BDBM50006614
Synonyms:
CHEMBL3235482
Type:
Small organic molecule
Emp. Form.:
C19H19FN2O2S
Mol. Mass.:
358.43
SMILES:
Fc1ccc2c(c1)-c1ccc(cc1S2(=O)=O)N1CCN2CCC1CC2
: