Target
Replication protein A 70 kDa DNA-binding subunit
Ligand
BDBM50006657
Substrate
Meas. Tech.
ChEMBL_1336209 (CHEMBL3241316)
Kd
63000±n/a nM
Citation
 Frank, AOVangamudi, BFeldkamp, MDSouza-Fagundes, EMLuzwick, JWCortez, DOlejniczak, ETWaterson, AGRossanese, OWChazin, WJFesik, SW Discovery of a potent stapled helix peptide that binds to the 70N domain of replication protein A. J Med Chem 57:2455-61 (2014)  
Target
Name:
Replication protein A 70 kDa DNA-binding subunit
Synonyms:
REPA1 RFA1_HUMAN RPA1 Replication factor A protein 1 | Single-stranded DNA-binding protein
Type:
Enzyme
Mol. Mass.:
68139.43
Organism:
Homo sapiens (Human)
Description:
P27694
Residue:
616
  
Inhibitor
Name:
BDBM50006657
Synonyms:
CHEMBL3236275
Type:
Small organic molecule
Emp. Form.:
C69H104N16O31
Mol. Mass.:
1653.6527
SMILES:
CC(C)C[C@H](NC(=O)[C@H](CCC(O)=O)NC(=O)[C@H](CCC(O)=O)NC(=O)[C@H](CC(C)C)NC(=O)[C@H](CC(O)=O)NC(=O)[C@H](CC(O)=O)NC(=O)[C@H](C)NC(=O)[C@@H](NC(=O)[C@H](Cc1ccccc1)NC(=O)[C@H](CC(O)=O)NC(C)=O)[C@@H](C)O)C(=O)N[C@@H](CC(O)=O)C(=O)N[C@@H]([C@@H](C)O)C(=O)N[C@@H](C)C(=O)N[C@@H](C)C(=O)N[C@@H](CO)C(N)=O
: