Target
Androgen receptor
Ligand
BDBM50007593
Substrate
Meas. Tech.
ChEMBL_1339116 (CHEMBL3243251)
IC50
366±n/a nM
Citation
 Piatnitski Chekler, ELUnwalla, RKhan, TATangirala, RSJohnson, MSt Andre, MAnderson, JTKenney, TChiparri, SMcNally, CKilbourne, EThompson, CNagpal, SWeber, GSchelling, SOwens, JMorris, CAPowell, DVerhoest, PRGilbert, AM 1-(2-Hydroxy-2-methyl-3-phenoxypropanoyl)indoline-4-carbonitrile derivatives as potent and tissue selective androgen receptor modulators. J Med Chem 57:2462-71 (2014)  
Target
Name:
Androgen receptor
Synonyms:
ANDR_HUMAN Androgen Receptor Androgen receptor/Baculoviral IAP repeat-containing protein 2 Dihydrotestosterone receptor Nuclear receptor subfamily 3 group C member 4
Type:
Receptor
Mol. Mass.:
99185.27
Organism:
Homo sapiens (Human)
Description:
CHO cells were stably transfected with human AR gene.
Residue:
920
  
Inhibitor
Name:
BDBM50007593
Synonyms:
CHEMBL3238294
Type:
Small organic molecule
Emp. Form.:
C20H19ClN2O4
Mol. Mass.:
386.829
SMILES:
COc1cc(Cl)ccc1OC[C@](C)(O)C(=O)N1CCc2c1cccc2C#N
: