Target
Proteasome subunit beta type-5
Ligand
BDBM50007725
Substrate
Meas. Tech.
ChEMBL_1334922 (CHEMBL3239238)
Ki
300±n/a nM
Citation
 Scarbaci, KTroiano, VMicale, NEttari, RTamborini, LDi Giovanni, CCerchia, CGrasso, SNovellino, ESchirmeister, TLavecchia, AZappalą, M Identification of a new series of amides as non-covalent proteasome inhibitors. Eur J Med Chem 76:1-9 (2014)  
Target
Name:
Proteasome subunit beta type-5
Synonyms:
20S proteasome chymotrypsin-like LMPX PSB5_HUMAN Proteasome Macropain subunit MB1 X
Type:
Protein
Mol. Mass.:
28480.96
Organism:
Homo sapiens (Human)
Description:
Residue:
263
  
Inhibitor
Name:
BDBM50007725
Synonyms:
CHEMBL3233450
Type:
Small organic molecule
Emp. Form.:
C17H30BN3O4
Mol. Mass.:
351.249
SMILES:
CC(C)C[C@H](NC(=O)CN1C=CC(CC1=O)N1CCCCC1)B(O)O
: