Target
Squalene synthase
Ligand
BDBM50007808
Substrate
Meas. Tech.
ChEMBL_1336736 (CHEMBL3240996)
IC50
3600±n/a nM
Citation
 Matralis, ANKourounakis, AP Design of novel potent antihyperlipidemic agents with antioxidant/anti-inflammatory properties: exploiting phenothiazine's strong antioxidant activity. J Med Chem 57:2568-81 (2014)  
Target
Name:
Squalene synthase
Synonyms:
FDFT_RAT Farnesyl-diphosphate farnesyltransferase SQS Squalene synthetase
Type:
PROTEIN
Mol. Mass.:
48109.41
Organism:
Rattus norvegicus
Description:
ChEMBL_1336736
Residue:
416
  
Inhibitor
Name:
BDBM50007808
Synonyms:
CHEMBL3234106
Type:
Small organic molecule
Emp. Form.:
C18H20N2O2S
Mol. Mass.:
328.429
SMILES:
CN1CCOC(O)(C1)c1ccc2Sc3ccccc3N(C)c2c1
: