Target
E3 ubiquitin-protein ligase Mdm2
Ligand
BDBM50008763
Substrate
Meas. Tech.
ChEMBL_1336775 (CHEMBL3241171)
IC50
0.100000±n/a nM
Citation
 Gonzalez, AZLi, ZBeck, HPCanon, JChen, AChow, DDuquette, JEksterowicz, JFox, BMFu, JHuang, XHouze, JJin, LLi, YLing, YLo, MCLong, AMMcGee, LRMcIntosh, JOliner, JDOsgood, TRew, YSaiki, AYShaffer, PWortman, SYakowec, PYan, XYe, QYu, DZhao, XZhou, JOlson, SHSun, DMedina, JC Novel inhibitors of the MDM2-p53 interaction featuring hydrogen bond acceptors as carboxylic acid isosteres. J Med Chem 57:2963-88 (2014)  
Target
Name:
E3 ubiquitin-protein ligase Mdm2
Synonyms:
Double minute 2 protein E3 ubiquitin-protein ligase Mdm2 (p53-binding protein Mdm2) Human Double Minute 2 (HDM2) MDM2-MDMX p53-Binding Protein MDM2 | p53-binding protein
Type:
Oncoprotein
Mol. Mass.:
55196.54
Organism:
Homo sapiens (Human)
Description:
Q00987
Residue:
491
  
Inhibitor
Name:
BDBM50008763
Synonyms:
CHEMBL3236636
Type:
Small organic molecule
Emp. Form.:
C34H42Cl2N2O6S
Mol. Mass.:
677.678
SMILES:
CC(C)(C)S(=O)(=O)C[C@H](C1CC1)N1[C@@H]([C@H](C[C@](C)(CC(=O)N2CC[C@@H](C2)C(O)=O)C1=O)c1cccc(Cl)c1)c1ccc(Cl)cc1
: