Target
Delta-type opioid receptor
Ligand
BDBM50008834
Substrate
Meas. Tech.
ChEMBL_1337151 (CHEMBL3240182)
Ki
105±n/a nM
Citation
 Bai, LLi, ZChen, JChung, NNWilkes, BCLi, TSchiller, PW [Dmt(1)]DALDA analogues with enhancedµ opioid agonist potency and with a mixedµ/¿ opioid activity profile. Bioorg Med Chem 22:2333-8 (2014)  
Target
Name:
Delta-type opioid receptor
Synonyms:
Cytochrome P450 3A4 Delta opioid receptor Delta-type opioid receptor (DOR) OPRD_RAT Opioid receptor Opioid receptors; mu & delta Ror-a | Voltage-gated potassium channel
Type:
G Protein-Coupled Receptor (GPCR)
Mol. Mass.:
40465.04
Organism:
Rattus norvegicus (rat)
Description:
Competition binding assays were using CHO-K1 cell membranes expressing the opioid receptor.
Residue:
372
  
Inhibitor
Name:
BDBM50008834
Synonyms:
CHEMBL3236671
Type:
Small organic molecule
Emp. Form.:
C34H52N8O6
Mol. Mass.:
668.8267
SMILES:
Cc1cccc(C)c1C[C@H](NC(=O)[C@@H](CCCNC(N)=N)NC(=O)[C@@H](N)Cc1c(C)cc(O)cc1C)C(=O)N[C@@H](CCCCN)C(O)=O
: