Target
Kappa-type opioid receptor
Ligand
BDBM50008834
Substrate
Meas. Tech.
ChEMBL_1337152 (CHEMBL3240183)
Ki
4.7±n/a nM
Citation
 Bai, LLi, ZChen, JChung, NNWilkes, BCLi, TSchiller, PW [Dmt(1)]DALDA analogues with enhancedµ opioid agonist potency and with a mixedµ/¿ opioid activity profile. Bioorg Med Chem 22:2333-8 (2014)  
Target
Name:
Kappa-type opioid receptor
Synonyms:
Kappa Opioid Receptor OPRK1 Opiate Kappa 1 | mu/kappa opioid receptor
Type:
G Protein-Coupled Receptor (GPCR)
Mol. Mass.:
42744.99
Organism:
Cavia porcellus (domestic guinea pig)
Description:
P41144
Residue:
380
  
Inhibitor
Name:
BDBM50008834
Synonyms:
CHEMBL3236671
Type:
Small organic molecule
Emp. Form.:
C34H52N8O6
Mol. Mass.:
668.8267
SMILES:
Cc1cccc(C)c1C[C@H](NC(=O)[C@@H](CCCNC(N)=N)NC(=O)[C@@H](N)Cc1c(C)cc(O)cc1C)C(=O)N[C@@H](CCCCN)C(O)=O
: