Target
Kappa-type opioid receptor
Ligand
BDBM50008841
Substrate
Meas. Tech.
ChEMBL_1337154 (CHEMBL3240185)
Ki
22±n/a nM
Citation
 Bai, LLi, ZChen, JChung, NNWilkes, BCLi, TSchiller, PW [Dmt(1)]DALDA analogues with enhancedµ opioid agonist potency and with a mixedµ/¿ opioid activity profile. Bioorg Med Chem 22:2333-8 (2014)  
Target
Name:
Kappa-type opioid receptor
Synonyms:
Kappa Opioid Receptor OPRK1 Opiate Kappa 1 | mu/kappa opioid receptor
Type:
G Protein-Coupled Receptor (GPCR)
Mol. Mass.:
42744.99
Organism:
Cavia porcellus (domestic guinea pig)
Description:
P41144
Residue:
380
  
Inhibitor
Name:
BDBM50008841
Synonyms:
CHEMBL3236678
Type:
Small organic molecule
Emp. Form.:
C32H48N8O6
Mol. Mass.:
640.7735
SMILES:
Cc1cc(O)cc(C)c1C[C@H](N)C(=O)N[C@H](CCCNC(N)=N)C(=O)N[C@@H](Cc1ccccc1)C(=O)N[C@@H](CCCCN)C(O)=O
: