Target
CD44 antigen
Ligand
BDBM50008915
Substrate
Meas. Tech.
ChEMBL_1337579 (CHEMBL3242488)
Kd
5400000±n/a nM
Citation
 Liu, LKFinzel, BC Fragment-based identification of an inducible binding site on cell surface receptor CD44 for the design of protein-carbohydrate interaction inhibitors. J Med Chem 57:2714-25 (2014)  
Target
Name:
CD44 antigen
Synonyms:
CD44 CD_antigen=CD44 ECMR-III Extracellular matrix receptor III HUTCH-I Hermes antigen LHR MDU3 PGP-1 Phagocytic glycoprotein 1 | Phagocytic glycoprotein I
Type:
PROTEIN
Mol. Mass.:
81511.49
Organism:
Homo sapiens (Human)
Description:
ChEMBL_108280
Residue:
742
  
Inhibitor
Name:
BDBM50008915
Synonyms:
CHEMBL3237625
Type:
Small organic molecule
Emp. Form.:
C7H9ClN2
Mol. Mass.:
156.613
SMILES:
Cc1cc(N)c(N)cc1Cl
: