Target
CD44 antigen
Ligand
BDBM50008908
Substrate
Meas. Tech.
ChEMBL_1337580 (CHEMBL3242489)
Kd
428000±n/a nM
Citation
 Liu, LKFinzel, BC Fragment-based identification of an inducible binding site on cell surface receptor CD44 for the design of protein-carbohydrate interaction inhibitors. J Med Chem 57:2714-25 (2014)  
Target
Name:
CD44 antigen
Synonyms:
CD44_MOUSE Cd44 Extracellular matrix receptor III HUTCH-I Hyaluronate receptor | Ly-24
Type:
PROTEIN
Mol. Mass.:
85579.86
Organism:
Mus musculus
Description:
ChEMBL_108281
Residue:
778
  
Inhibitor
Name:
BDBM50008908
Synonyms:
CHEMBL3237619
Type:
Small organic molecule
Emp. Form.:
C28H44N2O23
Mol. Mass.:
776.6486
SMILES:
[H][C@@]1(O[C@H]2[C@H](O)[C@@H](CO)O[C@@]([H])(O[C@H]3[C@H](O)[C@@H](O)[C@H](O)O[C@@H]3C(O)=O)[C@@H]2NC(C)=O)O[C@@H]([C@@H](O[C@]2([H])O[C@H](CO)[C@@H](O)[C@H](O)[C@H]2NC(C)=O)[C@H](O)[C@H]1O)C(O)=O
: