Target
CD44 antigen
Ligand
BDBM13016
Substrate
Meas. Tech.
ChEMBL_1337580 (CHEMBL3242489)
Kd
11200000±n/a nM
Citation
 Liu, LKFinzel, BC Fragment-based identification of an inducible binding site on cell surface receptor CD44 for the design of protein-carbohydrate interaction inhibitors. J Med Chem 57:2714-25 (2014)  
Target
Name:
CD44 antigen
Synonyms:
CD44_MOUSE Cd44 Extracellular matrix receptor III HUTCH-I Hyaluronate receptor | Ly-24
Type:
PROTEIN
Mol. Mass.:
85579.86
Organism:
Mus musculus
Description:
ChEMBL_108281
Residue:
778
  
Inhibitor
Name:
BDBM13016
Synonyms:
1,2,3,4-tetrahydroisoquinoline THIQ 6 | tetrahydroisoquinoline
Type:
Small organic molecule
Emp. Form.:
C9H11N
Mol. Mass.:
133.1903
SMILES:
C1Cc2ccccc2CN1
: