Target
ATP-dependent translocase ABCB1
Ligand
BDBM50009054
Substrate
Meas. Tech.
ChEMBL_1338425 (CHEMBL3240478)
EC50
7.1±n/a nM
Citation
 Nesi, GColabufo, NAContino, MPerrone, MGDigiacomo, MPerrone, RLapucci, AMacchia, MRapposelli, S SAR study on arylmethyloxyphenyl scaffold: looking for a P-gp nanomolar affinity. Eur J Med Chem 76:558-66 (2014)  
Target
Name:
ATP-dependent translocase ABCB1
Synonyms:
ABCB1 MDR1_HUMAN Multidrug resistance protein 1 P-glycoprotein (P-gp) PGY1
Type:
Protein
Mol. Mass.:
141503.50
Organism:
Homo sapiens (Human)
Description:
P08183
Residue:
1280
  
Inhibitor
Name:
BDBM50009054
Synonyms:
CHEMBL3237954
Type:
Small organic molecule
Emp. Form.:
C27H32O7
Mol. Mass.:
468.5388
SMILES:
COc1cc(CCc2ccccc2OCc2cc(OC)c(OC)c(OC)c2)cc(OC)c1OC
: