Target
Glandular kallikrein
Ligand
BDBM50027284
Substrate
Meas. Tech.
ChEMBL_1342913 (CHEMBL3259188)
Ki
5160±n/a nM
Citation
 Tidwell, RRGeratz, JDDann, OVolz, GZeh, DLoewe, H Diarylamidine derivatives with one or both of the aryl moieties consisting of an indole or indole-like ring. Inhibitors of arginine-specific esteroproteases. J Med Chem 21:613-23 (1978)  
Target
Name:
Glandular kallikrein
Synonyms:
KLK_PIG | Tissue kallikrein
Type:
PROTEIN
Mol. Mass.:
26710.38
Organism:
Sus scrofa
Description:
ChEMBL_108296
Residue:
242
  
Inhibitor
Name:
BDBM50027284
Synonyms:
2-{4-[5-(4-Carbamimidoyl-phenoxy)-pentyloxy]-phenyl}-1H-benzoimidazole-5-carboxamidine | CHEMBL101672
Type:
Small organic molecule
Emp. Form.:
C26H28N6O2
Mol. Mass.:
456.5395
SMILES:
NC(=N)c1ccc(OCCCCCOc2ccc(cc2)-c2nc3ccc(cc3[nH]2)C(N)=N)cc1
: