Target
Acrosin
Ligand
BDBM50010086
Substrate
Meas. Tech.
ChEMBL_1344334 (CHEMBL3257004)
Ki
3900±n/a nM
Citation
 Parrish, RFStraus, JWPaulson, JDPolakoski, KLTidwell, RRGeratz, JDStevens, FM Structure-activity relationships for the inhibition of acrosin by benzamidine derivatives. J Med Chem 21:1132-6 (1979)  
Target
Name:
Acrosin
Synonyms:
53 kDa fucose-binding protein ACRO_PIG Acrosin light chain
Type:
PROTEIN
Mol. Mass.:
45383.66
Organism:
Sus scrofa
Description:
ChEMBL_108297
Residue:
415
  
Inhibitor
Name:
BDBM50010086
Synonyms:
CHEMBL3244440
Type:
Small organic molecule
Emp. Form.:
C15H13N3O
Mol. Mass.:
251.2832
SMILES:
NC(=N)c1ccc(COc2ccc(cc2)C#N)cc1
: