Target
Acrosin
Ligand
BDBM50010129
Substrate
Meas. Tech.
ChEMBL_1344334 (CHEMBL3257004)
Ki
1300±n/a nM
Citation
 Parrish, RFStraus, JWPaulson, JDPolakoski, KLTidwell, RRGeratz, JDStevens, FM Structure-activity relationships for the inhibition of acrosin by benzamidine derivatives. J Med Chem 21:1132-6 (1979)  
Target
Name:
Acrosin
Synonyms:
53 kDa fucose-binding protein ACRO_PIG Acrosin light chain
Type:
PROTEIN
Mol. Mass.:
45383.66
Organism:
Sus scrofa
Description:
ChEMBL_108297
Residue:
415
  
Inhibitor
Name:
BDBM50010129
Synonyms:
CHEMBL3245417
Type:
Small organic molecule
Emp. Form.:
C30H30N6O3
Mol. Mass.:
522.5976
SMILES:
NC(=N)c1ccc(OCc2cc(COc3ccc(cc3)C(N)=N)cc(COc3ccc(cc3)C(N)=N)c2)cc1
: