Target
Adenylate kinase 2, mitochondrial
Ligand
BDBM50010313
Substrate
Meas. Tech.
ChEMBL_1340550 (CHEMBL3254974)
Ki
250000±n/a nM
Citation
 Hampton, APicker, D Design of species- or isozyme-specific enzyme inhibitors. 3. Species and isozymic differences between mammalian and bacterial adenylate kinases in substituent tolerance in an enzyme-substrate complex. J Med Chem 22:1529-32 (1980)  
Target
Name:
Adenylate kinase 2, mitochondrial
Synonyms:
2.7.4.3 ATP-AMP transphosphorylase 2 Adenylate kinase 2 Adenylate monophosphate kinase KAD2_RAT
Type:
Mol. Mass.:
26380.21
Organism:
Rattus norvegicus
Description:
Residue:
239
  
Inhibitor
Name:
BDBM50010313
Synonyms:
CHEMBL3251361
Type:
Small organic molecule
Emp. Form.:
C12H20N5O14P3S
Mol. Mass.:
583.299
SMILES:
Nc1ncnc2n([C@@H]3O[C@H](COP(O)(=O)OP(O)(=O)OP(O)(O)=O)[C@@H](O)[C@H]3O)c(SCCO)nc12
: