Target
Adenosine receptor A2a
Ligand
BDBM50294501
Substrate
Meas. Tech.
ChEMBL_1352083 (CHEMBL3267348)
Ki
1.7±n/a nM
Citation
 de Lera Ruiz, MLim, YHZheng, J Adenosine A2A receptor as a drug discovery target. J Med Chem 57:3623-50 (2014)  
Target
Name:
Adenosine receptor A2a
Synonyms:
A2A adenosine receptor (hA2A) ADENOSINE A2 ADORA2 Adenosine A2A receptor (A2AAR)
Type:
G Protein-Coupled Receptor (GPCR)
Mol. Mass.:
44716.46
Organism:
Homo sapiens (Human)
Description:
P29274
Residue:
412
  
Inhibitor
Name:
BDBM50294501
Synonyms:
2-amino-6-(furan-2-yl)-N-((6-(methoxymethyl)pyridin-2-yl)methyl)pyrimidine-4-carboxamide | CHEMBL564473
Type:
Small organic molecule
Emp. Form.:
C17H17N5O3
Mol. Mass.:
339.3486
SMILES:
COCc1cccc(CNC(=O)c2cc(nc(N)n2)-c2ccco2)n1
: