Target
Adenosine receptor A2a
Ligand
BDBM50011300
Substrate
Meas. Tech.
ChEMBL_1352083 (CHEMBL3267348)
Ki
8.0±n/a nM
Citation
 de Lera Ruiz, MLim, YHZheng, J Adenosine A2A receptor as a drug discovery target. J Med Chem 57:3623-50 (2014)  
Target
Name:
Adenosine receptor A2a
Synonyms:
A2A adenosine receptor (hA2A) ADENOSINE A2 ADORA2 Adenosine A2A receptor (A2AAR)
Type:
G Protein-Coupled Receptor (GPCR)
Mol. Mass.:
44716.46
Organism:
Homo sapiens (Human)
Description:
P29274
Residue:
412
  
Inhibitor
Name:
BDBM50011300
Synonyms:
CHEMBL2398482 | US9133197, 2
Type:
Small organic molecule
Emp. Form.:
C12H16N8O
Mol. Mass.:
288.3084
SMILES:
CC(O)CCc1nc(N)c2nc(-n3nccn3)n(C)c2n1
: