Target
Adenosine receptor A2a
Ligand
BDBM50232154
Substrate
Meas. Tech.
ChEMBL_1352083 (CHEMBL3267348)
Ki
0.600000±n/a nM
Citation
 de Lera Ruiz, MLim, YHZheng, J Adenosine A2A receptor as a drug discovery target. J Med Chem 57:3623-50 (2014)  
Target
Name:
Adenosine receptor A2a
Synonyms:
A2A adenosine receptor (hA2A) ADENOSINE A2 ADORA2 Adenosine A2A receptor (A2AAR)
Type:
G Protein-Coupled Receptor (GPCR)
Mol. Mass.:
44716.46
Organism:
Homo sapiens (Human)
Description:
P29274
Residue:
412
  
Inhibitor
Name:
BDBM50232154
Synonyms:
CHEMBL401321 N-(2-furan-2-yl-6-pyrazol-1-yl-pyrimidin-4-yl)-acetamide
Type:
Small organic molecule
Emp. Form.:
C13H11N5O2
Mol. Mass.:
269.2587
SMILES:
CC(=O)Nc1cc(nc(n1)-c1ccco1)-n1cccn1
: