Target
Adenosine receptor A2a
Ligand
BDBM26256
Substrate
Meas. Tech.
ChEMBL_1352083 (CHEMBL3267348)
Ki
0.400000±n/a nM
Citation
 de Lera Ruiz, MLim, YHZheng, J Adenosine A2A receptor as a drug discovery target. J Med Chem 57:3623-50 (2014)  
Target
Name:
Adenosine receptor A2a
Synonyms:
A2A adenosine receptor (hA2A) ADENOSINE A2 ADORA2 Adenosine A2A receptor (A2AAR)
Type:
G Protein-Coupled Receptor (GPCR)
Mol. Mass.:
44716.46
Organism:
Homo sapiens (Human)
Description:
P29274
Residue:
412
  
Inhibitor
Name:
BDBM26256
Synonyms:
N-[2-(3,5-dimethyl-1H-pyrazol-1-yl)-6-[6-(4-methoxypiperidin-1-yl)pyridin-2-yl]pyrimidin-4-yl]acetamide | pyrazolylpyrimidine derivative, 16j
Type:
Small organic molecule
Emp. Form.:
C22H27N7O2
Mol. Mass.:
421.4955
SMILES:
COC1CCN(CC1)c1cccc(n1)-c1cc(NC(C)=O)nc(n1)-n1nc(C)cc1C
: