Target
Adenosine receptor A1
Ligand
BDBM50232154
Substrate
Meas. Tech.
ChEMBL_1352084 (CHEMBL3267349)
Ki
10±n/a nM
Citation
 de Lera Ruiz, MLim, YHZheng, J Adenosine A2A receptor as a drug discovery target. J Med Chem 57:3623-50 (2014)  
Target
Name:
Adenosine receptor A1
Synonyms:
A1 adenosine receptor (hA1) AA1R_HUMAN ADORA1 Adenosine A1-receptor Adenosine receptor A1 (hA1) | Adenosine transporter (AdT)
Type:
G Protein-Coupled Receptor (GPCR)
Mol. Mass.:
36520.92
Organism:
Homo sapiens (Human)
Description:
P30542
Residue:
326
  
Inhibitor
Name:
BDBM50232154
Synonyms:
CHEMBL401321 N-(2-furan-2-yl-6-pyrazol-1-yl-pyrimidin-4-yl)-acetamide
Type:
Small organic molecule
Emp. Form.:
C13H11N5O2
Mol. Mass.:
269.2587
SMILES:
CC(=O)Nc1cc(nc(n1)-c1ccco1)-n1cccn1
: