Target
Adenosine receptor A2a
Ligand
BDBM50316887
Substrate
Meas. Tech.
ChEMBL_1352082 (CHEMBL3267347)
Ki
6.5±n/a nM
Citation
 de Lera Ruiz, MLim, YHZheng, J Adenosine A2A receptor as a drug discovery target. J Med Chem 57:3623-50 (2014)  
Target
Name:
Adenosine receptor A2a
Synonyms:
A2A adenosine receptor (hA2A) ADENOSINE A2 ADORA2 Adenosine A2A receptor (A2AAR)
Type:
G Protein-Coupled Receptor (GPCR)
Mol. Mass.:
44716.46
Organism:
Homo sapiens (Human)
Description:
P29274
Residue:
412
  
Inhibitor
Name:
BDBM50316887
Synonyms:
2-amino-8-(2-morpholinoethoxy)-4-phenyl-5H-indeno[1,2-d]pyrimidin-5-one | CHEMBL1095488
Type:
Small organic molecule
Emp. Form.:
C23H22N4O3
Mol. Mass.:
402.4458
SMILES:
Nc1nc2-c3cc(OCCN4CCOCC4)ccc3C(=O)c2c(n1)-c1ccccc1
: