Target
Adenosine receptor A2a
Ligand
BDBM50011304
Substrate
Meas. Tech.
ChEMBL_1352082 (CHEMBL3267347)
Ki
5.3±n/a nM
Citation
 de Lera Ruiz, MLim, YHZheng, J Adenosine A2A receptor as a drug discovery target. J Med Chem 57:3623-50 (2014)  
Target
Name:
Adenosine receptor A2a
Synonyms:
A2A adenosine receptor (hA2A) ADENOSINE A2 ADORA2 Adenosine A2A receptor (A2AAR)
Type:
G Protein-Coupled Receptor (GPCR)
Mol. Mass.:
44716.46
Organism:
Homo sapiens (Human)
Description:
P29274
Residue:
412
  
Inhibitor
Name:
BDBM50011304
Synonyms:
CHEMBL3222062
Type:
Small organic molecule
Emp. Form.:
C18H22N4OS
Mol. Mass.:
342.458
SMILES:
C[C@H]1CCC[C@@H](C)N1Cc1cc2c(N)nc(nc2s1)-c1ccco1
: