Target
Melatonin receptor type 1A
Ligand
BDBM29611
Substrate
Meas. Tech.
ChEMBL_1352244 (CHEMBL3268962)
Ki
0.068000±n/a nM
Citation
 Zlotos, DPJockers, RCecon, ERivara, SWitt-Enderby, PA MT1 and MT2 melatonin receptors: ligands, models, oligomers, and therapeutic potential. J Med Chem 57:3161-85 (2014)  
Target
Name:
Melatonin receptor type 1A
Synonyms:
MTNR1A MTR1A_HUMAN Mel1a melatonin receptor Melatonin receptor Melatonin receptor type 1 (MT1) | Melatonin receptor type 1A
Type:
Enzyme
Mol. Mass.:
39392.94
Organism:
Homo sapiens (Human)
Description:
P48039
Residue:
350
  
Inhibitor
Name:
BDBM29611
Synonyms:
2-Iodomelatonin Melatonin,2-Iodo
Type:
Small organic molecule
Emp. Form.:
C13H15IN2O2
Mol. Mass.:
358.1749
SMILES:
COc1ccc2[nH]c(I)c(CCNC(C)=O)c2c1
: