Target
Protein kinase C delta type
Ligand
BDBM50011801
Substrate
Meas. Tech.
ChEMBL_1351519 (CHEMBL3268114)
Kd
1206±n/a nM
Citation
 Pu, YKang, JHSigano, DMPeach, MLLewin, NEMarquez, VEBlumberg, PM Diacylglycerol lactones targeting the structural features that distinguish the atypical C1 domains of protein kinase C¿ and¿ from typical C1 domains. J Med Chem 57:3835-44 (2014)  
Target
Name:
Protein kinase C delta type
Synonyms:
KPCD_MOUSE Prkcd Protein kinase C delta type | nPKC-delta
Type:
PROTEIN
Mol. Mass.:
77554.99
Organism:
Mus musculus
Description:
ChEMBL_1351519
Residue:
674
  
Inhibitor
Name:
BDBM50011801
Synonyms:
CHEMBL3262936
Type:
Small organic molecule
Emp. Form.:
C19H22O7
Mol. Mass.:
362.3738
SMILES:
CC(C)(C)C(=O)OCC1(CO)C\C(=C/c2cccc(c2)C(O)=O)C(=O)O1
: