Target
Protein kinase C delta type
Ligand
BDBM50011804
Substrate
Meas. Tech.
ChEMBL_1351519 (CHEMBL3268114)
Kd
96±n/a nM
Citation
 Pu, YKang, JHSigano, DMPeach, MLLewin, NEMarquez, VEBlumberg, PM Diacylglycerol lactones targeting the structural features that distinguish the atypical C1 domains of protein kinase C¿ and¿ from typical C1 domains. J Med Chem 57:3835-44 (2014)  
Target
Name:
Protein kinase C delta type
Synonyms:
KPCD_MOUSE Prkcd Protein kinase C delta type | nPKC-delta
Type:
PROTEIN
Mol. Mass.:
77554.99
Organism:
Mus musculus
Description:
ChEMBL_1351519
Residue:
674
  
Inhibitor
Name:
BDBM50011804
Synonyms:
CHEMBL3262939
Type:
Small organic molecule
Emp. Form.:
C25H34O7
Mol. Mass.:
446.5333
SMILES:
CC(C)CC(CC(C)C)CC(=O)OCC1(CO)C\C(=C/c2ccc(cc2)C(O)=O)C(=O)O1
: